{"text_format":"1","workbook":"xlsx","n_sheets":11,"sheets":["gl. til nyt niveau","reguleringsprocenter","Lønark","Forside","Omregningstabel ","Tillæg_trin","Tillæg_kr","Omregner_gl. til nyt_niveau","Tid op_ned","Samlet_omk","Omregner_'18_niveau"],"not_rendered":{"charts":0,"images":10,"macros":1,"external_links":0,"defined_names":83,"comments":0,"pivot_tables":0},"unopened":[],"bounds":{"document_bytes":16777216,"sheet_cells":100000,"rows_first":2000,"rows_last":500,"rows_between":2000,"halvings":0,"cell_chars":16384,"cell_head_chars":4096},"cells_cut":0,"cells_raw":0,"read":"whole","date_system":"1900"}

{"sheet":"gl. til nyt niveau","index":0,"n_rows":395,"n_cols":6,"rows_kept":395,"cut":false,"hidden":true,"merged":[]}
[null,1.3980790000000001]
[null,null,null,"Nyt grundbeløb","Nyt grundbeløb"]
["Grundbeløb pr. 1/10-1984","I alt pr. 1. april 1999 inkl. %regulering",null,"pr. 31/3-2000","pr. 31/3-2000"]
[null,null,null,"ekskl. afrunding","inkl. afrunding"]
[null,null,null,null,null,"beløb"]
[null,"pr. gang/år","pr. måned",null,null,"+/-"]
[1.63,{"$f":"IF(A7<1000,$B$1*A7,ROUND($B$1*A7,0))","v":2.2788687699999999},null,{"$f":"B7","v":2.2788687699999999},{"$f":"IF(D7<1000,D7,ROUND(D7,-2))","v":2.2788687699999999}]
[5,6.9903950000000004,null,{"$f":"B8","v":6.9903950000000004},6.9903950000000004]
[5.8,8.1088582000000002,null,8.1088582000000002,8.1088582000000002]
[9,12.582711,null,12.582711,12.582711]
[10.5,14.6798295,null,14.6798295,14.6798295]
[12.22,17.084525380000002,null,17.084525380000002,17.084525380000002]
[12.65,17.68569935,null,17.68569935,17.68569935]
[13.39,18.720277810000002,null,18.720277810000002,18.720277810000002]
[13.75,19.22358625,null,19.22358625,19.22358625]
{"$rows_left_out":381}
{"sheet":"reguleringsprocenter","index":1,"n_rows":29,"n_cols":4,"rows_kept":29,"cut":false,"hidden":true,"merged":[]}
[]
[null,"Reguleringsprocenter",null,"pensionsudbygning"]
[null,"Valgt:",{"$f":"VLOOKUP(Forside!K11,reguleringsprocenter!B4:D15,2,TRUE)","v":1.1411089999999999}]
[null,"2020-01-01",1.045075,1]
[null,"2020-04-01",1.049075,1]
[null,"2020-10-01",1.0532239999999999,1]
[null,"2021-04-01",1.061123,1]
[null,"2021-10-01",1.0644739999999999,1]
[null,"2022-04-01",1.0644739999999999,1]
[null,"2022-10-01",1.083866,1]
[null,"2023-01-01",1.0919760000000001,1]
[null,"2023-10-01",1.0972200000000001,1]
[null,"2024-04-01",1.1411089999999999,1]
[null,null,null,1]
[]
{"$rows_left_out":15}
{"sheet":"Lønark","index":2,"n_rows":70,"n_cols":120,"rows_kept":70,"cut":false,"hidden":true,"merged":[]}
["Næstved",null,null,null,null,null,null,null,null,null,null,null,null,null,null,null,null,null,null,null,null,null,null,"Løn","Årsløn",null,null,"Ureguleret ikke-pensionsgivende tillæg",null,null,null,"Årsløn ialt "]
[null,null,null,null,null,null,null,null,null,null,null,null,null,null,null,null,null,null,null,null,null,null,null,"trin","Grundsats","%-reg.","Sats","Omr 1","Omr 2","Omr 3","Omr 4",null,null,null,null,null,null,"Områdetillæg inkl. regulering",null,null,null,null,"Årsløn i alt ",null,null,null,null,null,"Pensionsgivende årsløn i alt ",null,null,null,null,"Pensionsgivende løn",null,null,null,null,null,null,null,null,"Pensionsgivende løn",null,null,null,null,null,"Løn","timelønninger",null,null,null,null,null,"Løn","timelønninger + 50%",null,null,null,null,null,"Løn","søndagstillæg - 50%",null,null,null,null,null,null,null,null,null,null,null,null,null,null,null,null,null,null,null,null,null,1.3441050000000001]
[null,"Månedsløn, løngrupper",null,null,"Lønniveau:",{"$f":"VLOOKUP(beregningsdato,regpct_tabel,1,TRUE)","v":"2024-04-01"},null,"Optrapning fra:",null,null,null,null,"Pensionsgivende løn",null,null,null,null,null,"Pensionsgivende løn, optrapning fra:",null,null,null,null,null,null,null,null,null,null,null,null,null,null,null,null,null,null,1,2,3,4,null,"Omr 0","Omr 1","Omr 2","Omr 3","Omr 4",null,"Omr 0","Omr 1","Omr 2","Omr 3","Omr 4","Grundsats","%-reg.","Sats",null,"Pensionsudbygningspct:",null,null,{"$f":"VLOOKUP(F3,regpct_tabel,3,FALSE)","v":1},null,"Omr 0","Omr 1","Omr 2","Omr 3","Omr 4",null,"trin","Omr 0","Omr 1","Omr 2","Omr 3","Omr 4",null,"trin","Omr 0","Omr 1","Omr 2","Omr 3","Omr 4",null,"trin","Omr 0","Omr 1","Omr 2","Omr 3","Omr 4",null,null,null,null,null,null,null,null,null,null,null,null,null,null,"niveau","kolonne",null,"2017-10-01",null,null,null,"2018-10-01"]
[null,0,1,2,3,4,null,"0->1","1->2","2->3",null,null,0,1,2,3,4,null,"0->1","1->2","2->3","3->4",null,null,{"$f":"VLOOKUP(beregningsdato,Lønprojekt_DR,2,TRUE)","v":1339},{"$f":"valgt_regulering-1","v":0.14110899999999993},"2019-04-01","2022-04-01",{"$f":"VLOOKUP(beregningsdato,Lønprojekt_DR,3,TRUE)","v":620},4,5,null,null,null,null,null,null,{"$f":"IF(beregningsdato<40087,0,regulering)","v":0.14110899999999993},{"$f":"IF(beregningsdato<40087,0,5)","v":5},null,null,null,null,null,null,null,null,null,null,null,null,null,null,null,null,null,null,null,null,null,null,null,null,null,null,null,null,null,null,null,null,null,null,null,null,null,null,null,null,null,null,null,null,null,null,null,null,null,null,null,"2017-10-01","2018-10-01","2019-04-01",null,"omr1","omr2","omr3","omr4","omr5",null,null,null,"2017-10-01",2,null,"omr1","omr2","omr3","omr4","omr1","omr2","omr3","omr4",null,null,null,null,"2015-01-01",0,0]
[1,{"$f":"AQ5/12","v":18813.5},19078.833333333332,19262.5,19528,19711.666666666668,null,{"$f":"ROUND(AQ5+(AR5-AQ5)/3*faktor,0)/12","v":518966.83333333331},{"$f":"ROUND(AR5+(AS5-AR5)/3*faktor,0)/12","v":365290.5},{"$f":"ROUND(AS5+(AT5-AS5)/3*faktor,0)/12","v":519730},null,1,{"$f":"B5","v":18813.5},{"$f":"C5","v":19078.833333333332},{"$f":"D5","v":19262.5},{"$f":"E5","v":19528},{"$f":"F5","v":19711.666666666668},null,{"$f":"(BK5+ROUND((BL5-BK5)/3*faktor,0))/12","v":500153.33333333331},{"$f":"(BL5+ROUND((BM5-BL5)/3*faktor,0))/12","v":346477},{"$f":"(BM5+ROUND((BN5-BM5)/3*faktor,0))/12","v":500916.5},{"$f":"(BN5+ROUND((BO5-BN5)/3*faktor,0))/12","v":346926.16666666669},null,1,197844,{"$f":"ROUND(Y5*regulering,0)","v":27918},{"$f":"Y5+Z5","v":225762},2790,4722,7514,9445,null,2076,3513,5590,7027,null,{"$f":"ROUND(AB5*(1+$AL$4),0)","v":3184},{"$f":"ROUND(AC5*(1+$AL$4),0)","v":5388},8574,10778,1,{"$f":"$AA5","v":225762},{"$f":"$AA5+AL5","v":228946},{"$f":"$AA5+AM5","v":231150},234336,236540,1,{"$f":"AQ5","v":225762},{"$f":"AR5","v":228946},{"$f":"AS5","v":231150},{"$f":"AT5","v":234336},{"$f":"AU5","v":236540},null,null,null,null,{"$f":"ROUND(AL5*udbygningspct,0)","v":3184},{"$f":"ROUND(AM5*udbygningspct,0)","v":5388},{"$f":"ROUND(AN5*udbygningspct,0)","v":8574},{"$f":"ROUND(AO5*udbygningspct,0)","v":10778},null,{"$f":"BD5","v":0},{"$f":"$BK5+BF5","v":3184},{"$f":"$BK5+BG5","v":5388},{"$f":"$BK5+BH5","v":8574},{"$f":"$BK5+BI5","v":10778},null,1,{"$f":"AQ5/1924","v":117.33991683991684},{"$f":"AR5/1924","v":118.9948024948025},{"$f":"AS5/1924","v":120.14033264033264},{"$f":"AT5/1924","v":121.79625779625779},{"$f":"AU5/1924","v":122.94178794178794},null,1,{"$f":"AQ5/1924*1.5","v":176.00987525987526},{"$f":"AR5/1924*1.5","v":178.49220374220374},{"$f":"AS5/1924*1.5","v":180.21049896049897},{"$f":"AT5/1924*1.5","v":182.69438669438668},{"$f":"AU5/1924*1.5","v":184.4126819126819},null,1,{"$f":"AQ5/1924/2","v":58.669958419958419},{"$f":"AR5/1924/2","v":59.49740124740125},{"$f":"AS5/1924/2","v":60.070166320166322},{"$f":"AT5/1924/2","v":60.898128898128896},{"$f":"AU5/1924/2","v":61.470893970893968},null,1,147194,197844,197844,4004,201848,2585,4374,6959,8748,null,null,null,"2018-10-01",3,1,2076,3513,5590,7027,{"$f":"ROUND(DB5*$DB$2,0)","v":2790},{"$f":"ROUND(DC5*$DB$2,0)","v":4722},{"$f":"ROUND(DD5*$DB$2,0)","v":7514},{"$f":"ROUND(DE5*$DB$2,0)","v":9445},null,147194,{"$f":"ROUND(DK5*$DB$2,0)","v":197844},null,"2019-04-01",719,0]
[2,19102.416666666668,19374.25,19562.416666666668,19834.25,20022.416666666668,null,531508.25,374068.41666666669,531968.25,null,2,{"$f":"B6","v":19102.416666666668},19374.25,19562.416666666668,19834.25,20022.416666666668,null,512405.83333333331,354966,512865.83333333331,355426,null,2,200883,{"$f":"ROUND(Y6*regulering,0)","v":28346},229229,2859,4837,7696,9675,null,2127,3599,5726,7198,null,{"$f":"ROUND(AB6*(1+$AL$4),0)","v":3262},{"$f":"ROUND(AC6*(1+$AL$4),0)","v":5520},{"$f":"ROUND(AD6*(1+$AL$4),0)","v":8782},{"$f":"ROUND(AE6*(1+$AL$4),0)","v":11040},2,{"$f":"$AA6","v":229229},{"$f":"$AA6+AL6","v":232491},234749,238011,240269,2,{"$f":"AQ6","v":229229},232491,234749,238011,240269,null,null,null,null,3262,5520,8782,11040,null,0,3262,5520,8782,11040,null,2,119.14189189189189,120.83731808731808,122.01091476091476,123.70634095634095,124.87993762993763,null,2,178.71283783783784,181.25597713097713,183.01637214137213,185.55951143451142,187.31990644490645,null,2,59.570945945945944,60.418659043659041,61.005457380457379,61.853170478170476,62.439968814968815,null,2,149455,200883,200883,4065,204948,2648,4481,7128,8961,null,null,null,"2019-04-01",4,2,2127,3599,5726,7198,{"$f":"ROUND(DB6*$DB$2,0)","v":2859},4837,7696,9675,null,149455,{"$f":"ROUND(DK6*$DB$2,0)","v":200883},null,"2022-04-01",{"$f":"DO5+DP6","v":1339},620]
[3,19399.25,19677.583333333332,19870.5,20148.833333333332,20341.75,null,544057.58333333337,383325.5,544528.83333333337,null,3,19399.25,19677.583333333332,19870.5,20148.833333333332,20341.75,null,524658.33333333337,363926.25,525129.58333333337,364397.5,null,3,204004,28787,232791,2927,4956,7883,9911,null,2178,3687,5865,7374,null,3340,5655,8995,11310,3,232791,236131,238446,241786,244101,3,232791,236131,238446,241786,244101,null,null,null,null,3340,5655,8995,11310,null,0,3340,5655,8995,11310,null,3,120.99324324324324,122.72920997920998,123.93243243243244,125.66839916839916,126.87162162162163,null,3,181.48986486486487,184.09381496881497,185.89864864864865,188.50259875259874,190.30743243243245,null,3,60.496621621621621,61.364604989604992,61.966216216216218,62.834199584199581,63.435810810810814,null,3,151777,204004,204004,4129,208133,2711,4590,7301,9180,null,null,null,null,null,3,2178,3687,5865,7374,2927,4956,7883,9911,null,151777,204004]
[4,19704.166666666668,19989.416666666668,20187.083333333332,20472.333333333332,20669.833333333332,null,557400.41666666663,392591.08333333331,557883.33333333337,null,4,19704.166666666668,19989.416666666668,20187.083333333332,20472.333333333332,20669.833333333332,null,537696.25,372886.91666666669,538179.16666666663,373055.66666666669,null,4,207211,29239,236450,3000,5078,8078,10155,null,2232,3778,6010,7555,null,3423,5795,9218,11588,4,236450,239873,242245,245668,248038,4,236450,239873,242245,245668,248038,null,null,null,null,3423,5795,9218,11588,null,0,3423,5795,9218,11588,null,4,122.89501039501039,124.67411642411642,125.90696465696466,127.68607068607069,128.91787941787942,null,4,184.34251559251558,187.01117463617464,188.860446985447,191.52910602910603,193.37681912681913,null,4,61.447505197505194,62.33705821205821,62.95348232848233,63.843035343035346,64.45893970893971,null,4,154163,207211,207211,4194,211405,2779,4703,7482,9405,null,null,null,null,null,4,2232,3778,6010,7555,3000,5078,8078,10155,null,154163,207211]
[5,20017.5,20309.833333333332,20512.25,20804.583333333332,21006.75,null,571065.83333333337,401865.25,571560.58333333337,null,5,20017.5,20309.833333333332,20512.25,20804.583333333332,21006.75,null,551048.33333333337,381847.75,551543.08333333337,381871.25,null,5,210506,29704,240210,3074,5203,8277,10403,null,2287,3871,6158,7740,null,3508,5937,9445,11871,5,240210,243718,246147,249655,252081,5,240210,243718,246147,249655,252081,null,null,null,null,3508,5937,9445,11871,null,0,3508,5937,9445,11871,null,5,124.84927234927235,126.67255717255718,127.93503118503118,129.758316008316,131.01923076923077,null,5,187.27390852390852,190.00883575883577,191.90254677754677,194.637474012474,196.52884615384616,null,5,62.424636174636177,63.336278586278588,63.967515592515589,64.879158004158,65.509615384615387,null,5,156614,210506,210506,4260,214766,2847,4819,7666,9636,null,null,null,null,null,5,2287,3871,6158,7740,3074,5203,8277,10403,null,156614,210506]
[6,20339.666666666668,20639.083333333332,20846.583333333332,21146.083333333332,21353.333333333332,null,584740.08333333337,411776.58333333331,585404.08333333337,null,6,20339.666666666668,20639.083333333332,20846.583333333332,21146.083333333332,21353.333333333332,null,564400.41666666663,391436.91666666669,565064.41666666663,391472.66666666669,null,6,213894,30182,244076,3149,5331,8480,10660,null,2343,3966,6309,7931,null,3593,6083,9677,12164,6,244076,247669,250159,253753,256240,6,244076,247669,250159,253753,256240,null,null,null,null,3593,6083,9677,12164,null,0,3593,6083,9677,12164,null,6,126.85862785862786,128.72609147609148,130.02027027027026,131.88825363825364,133.18087318087319,null,6,190.28794178794178,193.08913721413722,195.03040540540539,197.83238045738045,199.7713097713098,null,6,63.429313929313928,64.363045738045741,65.01013513513513,65.944126819126822,66.590436590436596,null,6,159135,213894,213894,4329,218223,2917,4937,7854,9873,null,null,null,null,null,6,2343,3966,6309,7931,3149,5331,8480,10660,null,159135,213894]
[7,20670.25,20977.083333333332,21189.833333333332,21496.583333333332,21709,null,599051.08333333337,422010.83333333331,599413.58333333337,null,7,20670.25,20977.083333333332,21189.833333333332,21496.583333333332,21709,null,578380.83333333337,401340.58333333331,578743.33333333337,401231.75,null,7,217370,30673,248043,3227,5464,8690,10924,null,2401,4065,6465,8127,null,3682,6235,9916,12465,7,248043,{"$f":"$AA11+AL11","v":251725},254278,257959,260508,7,248043,251725,254278,257959,260508,null,null,null,null,3682,6235,9916,12465,null,0,3682,6235,9916,12465,null,7,128.92047817047816,130.83419958419958,132.16112266112265,134.07432432432432,135.39916839916839,null,7,193.38071725571723,196.25129937629936,198.24168399168397,201.11148648648648,203.09875259875258,null,7,64.460239085239081,65.417099792099791,66.080561330561324,67.037162162162161,67.699584199584194,null,7,161721,217370,217370,4399,221769,2989,5060,8049,10118,null,null,null,null,null,7,2401,4065,6465,8127,3227,5464,8690,10924,null,161721,217370]
[8,21022.5,21337.416666666668,21555.416666666668,21870.166666666668,22088.083333333332,null,614640.41666666663,432267.41666666669,614859.16666666663,null,8,21022.5,21337.416666666668,21555.416666666668,21870.166666666668,22088.083333333332,null,593617.91666666663,411244.91666666669,593836.66666666663,411620.58333333331,null,8,221074,31196,252270,3312,5604,8914,11206,null,2464,4169,6632,8337,null,3779,6395,10172,12787,8,252270,256049,258665,262442,265057,8,252270,256049,258665,262442,265057,null,null,null,null,3779,6395,10172,12787,null,0,3779,6395,10172,12787,null,8,131.11746361746361,133.08160083160084,134.44126819126819,136.4043659043659,137.76351351351352,null,8,196.67619542619542,199.62240124740126,201.66190228690229,204.60654885654884,206.64527027027026,null,8,65.558731808731807,66.540800415800419,67.220634095634097,68.202182952182952,68.881756756756758,null,8,164477,221074,221074,4474,225548,3067,5190,8256,10379,null,null,null,null,null,8,2464,4169,6632,8337,3312,5604,8914,11206,null,164477,221074]
[9,21683.833333333332,22006.583333333332,22229.916666666668,22552.5,22775.833333333332,null,{"$f":"ROUND(AQ13+(AR13-AQ13)/3*faktor,0)/12","v":630067.58333333337},{"$f":"ROUND(AR13+(AS13-AR13)/3*faktor,0)/12","v":442989.91666666669},{"$f":"ROUND(AS13+(AT13-AS13)/3*faktor,0)/12","v":630299.5},null,9,21683.833333333332,22006.583333333332,22229.916666666668,22552.5,22775.833333333332,null,{"$f":"(BK13+ROUND((BL13-BK13)/3*faktor,0))/12","v":608383.75},{"$f":"(BL13+ROUND((BM13-BL13)/3*faktor,0))/12","v":421306.08333333331},{"$f":"(BM13+ROUND((BN13-BM13)/3*faktor,0))/12","v":608615.66666666663},{"$f":"(BN13+ROUND((BO13-BN13)/3*faktor,0))/12","v":421852},null,9,228029,32177,260206,3394,5743,9135,11484,null,2525,4273,6796,8544,null,3873,6553,10424,13104,9,260206,264079,266759,270630,273310,9,260206,264079,266759,270630,273310,null,null,null,null,3873,6553,10424,13104,null,0,3873,6553,10424,13104,null,9,135.24220374220374,137.25519750519751,138.6481288981289,140.66008316008316,142.05301455301455,null,9,202.86330561330561,205.88279625779626,207.97219334719335,210.99012474012474,213.07952182952181,null,9,67.621101871101871,68.627598752598757,69.324064449064451,70.330041580041581,71.026507276507274,null,9,169651,228029,228029,4615,232644,3143,5319,8461,10637,null,null,null,null,null,9,2525,4273,6796,8544,3394,5743,9135,11484,null,169651,228029]
[10,21836.916666666668,22167.583333333332,22396.666666666668,22727.25,22956.333333333332,null,645143.58333333337,453989.66666666669,645546.25,null,10,21836.916666666668,22167.583333333332,22396.666666666668,22727.25,22956.333333333332,null,623306.66666666663,432152.75,623709.33333333337,432712.41666666669,null,10,229639,32404,262043,3477,5886,9363,11772,null,2587,4379,6966,8758,null,3968,6717,10684,13433,10,262043,266011,268760,272727,275476,10,262043,266011,268760,272727,275476,null,null,null,null,3968,6717,10684,13433,null,0,3968,6717,10684,13433,null,10,136.19698544698545,138.25935550935552,139.68814968814968,141.75,143.17879417879419,null,10,204.29547817047819,207.38903326403329,209.53222453222452,212.625,214.76819126819129,null,10,68.098492723492726,69.129677754677758,69.844074844074839,70.875,71.589397089397096,null,10,170849,229639,229639,4647,234286,3221,5451,8672,10903,null,null,null,null,null,10,2587,4379,6966,8758,3477,5886,9363,11772,null,170849,229639]
[11,22247.75,22586.75,22821.5,23160.333333333332,23395.166666666668,null,661262.75,465090.5,661522.33333333337,null,11,22247.75,22586.75,22821.5,23160.333333333332,23395.166666666668,null,639015,442842.75,639274.58333333337,443573.41666666669,null,11,232620,{"$f":"ROUND(IF(beregningsdato>=$AA$4,SUM(Y15,$Y$4)*regulering,Y15*regulering),0)","v":33014},{"$f":"IF(beregningsdato>=$AA$4,SUM($Y$4,Y15:Z15),SUM(Y15:Z15))","v":266973},3565,6034,9597,12066,null,2652,4489,7140,8977,null,4068,6885,10951,13769,11,{"$f":"$AA15","v":266973},271041,273858,277924,280742,11,266973,271041,273858,277924,280742,null,null,null,null,4068,6885,10951,13769,null,0,4068,6885,10951,13769,null,11,138.75935550935552,140.87370062370061,142.33783783783784,144.45114345114345,145.91580041580042,null,11,208.13903326403329,211.31055093555091,213.50675675675677,216.67671517671516,218.87370062370064,null,11,69.379677754677758,70.436850311850307,71.168918918918919,72.225571725571726,72.957900207900209,null,11,173067,232620,233339,4722,237342,3301,5588,8889,11175,null,null,null,null,null,11,2652,4489,7140,8977,3565,6034,9597,12066,null,173067,232620]
{"$rows_left_out":56}
{"sheet":"Forside","index":3,"n_rows":11,"n_cols":11,"rows_kept":11,"cut":false,"hidden":false,"merged":[[14,3,14,7]]}
[]
[]
[]
[]
[]
[]
[]
[]
[]
[]
[null,null,null,null,null,null,null,null,null,"Lønniveau:","2024-04-01"]

{"sheet":"Omregningstabel ","index":4,"n_rows":25,"n_cols":16,"rows_kept":25,"cut":false,"hidden":true,"merged":[]}
[null,null,null,1.362716,1.3824959999999999,1.3980790000000001,1.018559,1.040662,1.0511569999999999,1.061566,1.0834220000000001,1.0886800000000001,1.0926750000000001,1.109523,1.1200380000000001,1.1244540000000001]
[]
[]
[]
[]
[]
[null,"Indtast beløb:",1000]
[]
[]
[null,null,"1/10 '84"]
[null,null,{"$f":"Beløb","v":1000},"1/4 '98"]
[null,"1/4-98",{"$f":"Beløb*_1_4_1998","v":1362.7160000000001},{"$f":"Beløb","v":1000},"1/10 '98"]
[null,"1/10-98",{"$f":"Beløb*_1_10_1998","v":1382.4959999999999},{"$f":"Beløb/_1_4_1998*_1_10_1998","v":1014.515130078461},{"$f":"Beløb","v":1000},"1/4 '99"]
[null,"1/4-99",{"$f":"Beløb*_1_4_1999","v":1398.0790000000002},{"$f":"Beløb/_1_4_1998*_1_4_1999","v":1025.9503814441161},{"$f":"Beløb/_1_10_1998*_1_4_1999","v":1011.2716420156008},{"$f":"Beløb","v":1000}]
[null,"Grundbeløb pr. 31/3-00",{"$f":"ROUND(C14,-2)","v":1400},{"$f":"ROUND(D14,-2)","v":1000},{"$f":"ROUND(E14,-2)","v":1000},{"$f":"ROUND(F14,-2)","v":1000},"1/4 '00"]
{"$rows_left_out":11}
{"sheet":"Tillæg_trin","index":5,"n_rows":16,"n_cols":4,"rows_kept":16,"cut":false,"hidden":true,"merged":[[1,1,1,7]]}
[3]
[]
[null,"Valgt lønniveau: ",{"$f":"Forside!K11","v":"2024-04-01"}]
[]
[null,"Løngruppe",null,3]
[null,"Timer/uge",null,37]
[null,"Pensions-% inkl. evt. fritvalgs-%",null,13.89]
[null,"Særlig feriegodtgørelse, aktuel pct.",null,1.95]
[]
[null,"Stigning:","Fra","Til"]
[null,"Løntrin ",18,19]
[]
[null,"Løn",{"$f":"(VLOOKUP(til_trin,Lønark!A4:F60,løngruppe+2,FALSE)-VLOOKUP(fra_trin,Lønark!A4:F60,løngruppe+2,FALSE))/37*timetal*12","v":4363.0000000000291}]
[null,"Pension inkl. evt. fritvalgstillæg",{"$f":"(VLOOKUP(til_trin,Lønark!L4:Q60,løngruppe+2,FALSE)-VLOOKUP(fra_trin,Lønark!L4:Q60,løngruppe+2,FALSE))/37*timetal*pensionsstatus%*12","v":606.02070000000401}]
[null,"Ferietillæg",{"$f":"ferie_pct%*C13","v":85.078500000000574}]
{"$rows_left_out":2}
{"sheet":"Tillæg_kr","index":6,"n_rows":15,"n_cols":4,"rows_kept":15,"cut":false,"hidden":true,"merged":[[9,1,9,2]]}
[2]
[]
[null,null,"Valgt lønniveau:",{"$f":"Forside!K11","v":"2024-04-01"}]
[]
[{"$f":"VLOOKUP(dummy,reg_procenter,2,FALSE)","v":{"$error":"#NAME?"}},null,"Årligt beløb, 31.3.2000 niveau ",12900]
[null,null,"Timer/uge",30]
[null,null,"Pension-% inkl. evt. fritvalgs-%",13.89]
[null,null,"Særlig feriegodtg., aktuel pct.",1.95]
[]
[]
[null,null,"bruttoudgift / år","bruttoudgift / md"]
[null,"Løn",{"$f":"kr*valgt_regulering/37*timetal","v":11935.383324324324},{"$f":"beløb/12","v":994.61527702702699}]
[null,"Pension inkl. evt. fritvalgstillæg",{"$f":"beløb*pensionsstatus%","v":1657.8247437486486},{"$f":"C13/12","v":138.15206197905405}]
[null,"Ferietillæg",{"$f":"D8%*(C12)","v":232.73997482432432},{"$f":"C14/12","v":19.394997902027026}]
[null,"Bruttoudgift i alt",{"$f":"ROUND(SUM(C12:C14),0)","v":13826},{"$f":"ROUND(SUM(D12:D14),0)","v":1152}]
{"$rows_left_out":1}
{"sheet":"Omregner_gl. til nyt_niveau","index":7,"n_rows":14,"n_cols":12,"rows_kept":14,"cut":false,"hidden":true,"merged":[[1,1,1,5],[1,9,1,13]]}
[]
[null,"Omregner A\n- fra grundbeløb 31.3.2000 niveau til nyt grundbeløb pr. 31.3.2018 - RLTN",null,null,null,null,null,null,null,"Omregner B\n- fra nutidskroner tilbage til nyt grundbeløb pr. 31.3.2018 - RLTN"]
[]
[null,"Brug omregneren, når satser og tillæg i lokale aftaler skal omlægges til ny niveau på regionsområdet",null,null,null,null,null,null,null,"Brug omregneren, når du vil finde ud af hvad et givent beløb i nutidskroner svarer til i nyt grundbeløb "]
[]
[]
[]
[null,"Kun ÅRLIGE grundbeløb;\nIndtast årligt grundbeløb pr. 31.3.2000",null,"Nyt grundbeløb \npr. 31.3.2018",null,{"$f":"\"Aktuelt beløb \npr. \"&DAY(beregningsdato)&\".\"&MONTH(beregningsdato)&\".\"&YEAR(beregningsdato)","v":"Aktuelt beløb \npr. 1.4.2024"},null,null,null,{"$f":"\"Tillæg pr. år;\nIndtast beløb i nutidskroner (\"&DAY(beregningsdato)&\".\"&MONTH(beregningsdato)&\".\"&YEAR(beregningsdato)&\")\"","v":"Tillæg pr. år;\nIndtast beløb i nutidskroner (1.4.2024)"},null,"svarer til:\nårligt grundbeløb (31/3-2018)"]
[null,1500,"=>",{"$f":"ROUND(B9*1.344105,0)","v":2016},"=>",{"$f":"ROUND(D9*valgt_regulering,2)","v":2300.48},null,null,null,31000,"=>",{"$f":"ROUND(J9/1.020238,0)","v":30385}]
[]
[]
[]
[null,"Grundbeløb pr. måned/uge eller pr. tidsenhed\nIndtast grundbeløb pr. 31.3.2000",null,"Nyt grundbeløb \npr. 31.3.2018",null,{"$f":"\"Aktuelt beløb \npr. \"&DAY(beregningsdato)&\".\"&MONTH(beregningsdato)&\".\"&YEAR(beregningsdato)","v":"Aktuelt beløb \npr. 1.4.2024"},null,null,null,{"$f":"\"Tillæg pr. måned/uge eller pr. tidsenhed;\nIndtast beløb i nutidskroner (\"&DAY(beregningsdato)&\".\"&MONTH(beregningsdato)&\".\"&YEAR(beregningsdato)&\")\"","v":"Tillæg pr. måned/uge eller pr. tidsenhed;\nIndtast beløb i nutidskroner (1.4.2024)"},null,"svarer til:\n grundbeløb \n(31/3-2018)"]
[null,34.85,"=>",{"$f":"ROUND(B14*1.344105,2)","v":46.84},"=>",{"$f":"ROUND(D14*valgt_regulering,2)","v":53.45},null,null,null,47.8,"=>",{"$f":"J14/valgt_regulering","v":41.889074575697855}]

{"sheet":"Tid op_ned","index":8,"n_rows":31,"n_cols":8,"rows_kept":31,"cut":false,"hidden":false,"merged":[]}
[2,"Valgt lønniveau: ",{"$f":"Forside!K11","v":"2024-04-01"}]
[]
[null,"Grundoplysninger:"]
[null,"Løngruppe",0]
[null,"Pensions-% inkl. evt. fritvalgs-%",14.7]
[null,"Særlig feriegodtgørelse, aktuel procent",1.95]
[]
[]
[null,"Lønsammensætning (trin i alt og grundbeløb i alt)","Før ændring",null,"Efter ændring"]
[]
[null,"Løndele:","I alt"]
[]
[null,"Løntrin - centralt og lokalt aftalte",22,null,22]
[]
["2018-10-01",{"$f":"IF(C1<A15,\"Tillæg (grundbeløb 31.3.2000) kr./år centralt og lokalt aftalte\",\"Tillæg (grundbeløb 31.3.2018) kr./år centralt og lokalt aftalte\")","v":"Tillæg (grundbeløb 31.3.2018) kr./år centralt og lokalt aftalte"},1300,null,1300]
{"$rows_left_out":17}
{"sheet":"Samlet_omk","index":9,"n_rows":23,"n_cols":3,"rows_kept":23,"cut":false,"hidden":false,"merged":[]}
[2,"Valgt lønniveau: ",{"$f":"Forside!K11","v":"2024-04-01"}]
[]
[null,"Løngruppe",0]
[null,"Timer/uge",37]
[null,"Pensions-% ",13.89]
[null,"Særlig feriegodtgørelse, aktuel pct.",1.95]
[]
[null,"Løntrin ",13]
[]
["2018-10-01",{"$f":"IF(C1<A10,\"Reguleret tillæg (niveau 31.3.2000) kr./år\",\"Reguleret tillæg (niveau 31.3.2018) kr./år\")","v":"Reguleret tillæg (niveau 31.3.2018) kr./år"},12903]
[]
[]
[null,"Løn/måned",{"$f":"(VLOOKUP(fra_trin,Lønkort_løn,løngruppe+2,FALSE)+(C10*valgt_regulering))/12/37*timetal","v":24243.394118916665}]
[null,"Pension inkl. evt. fritvalgstillæg",{"$f":"(VLOOKUP(fra_trin,Lønkort_pens,løngruppe+2,FALSE)+(C10*valgt_regulering))/12/37*timetal*pensionsstatus%","v":3367.4074431175245}]
[null,"Ferietillæg",{"$f":"C6%*C13","v":472.74618531887495}]
{"$rows_left_out":9}
{"sheet":"Omregner_'18_niveau","index":10,"n_rows":24,"n_cols":12,"rows_kept":24,"cut":false,"hidden":false,"merged":[]}
[null,null,null,null,null,null,null,null,null,null,null,"2018-10-01"]
[null,null,null,null,null,null,null,null,null,null,null,{"$f":"IF(F11<L1,\"00\",\"18\")","v":"18"}]
[]
[]
[]
[]
[]
[]
[]
[]
[null,null,null,"Valgt lønniveau:",null,{"$f":"Forside!K11","v":"2024-04-01"},null,"Timetal:",37]
[]
[null,{"$f":"\"1) Grundbeløb pr. 31-3-20\"&L2&\" omregnet til nutidskr.\"","v":"1) Grundbeløb pr. 31-3-2018 omregnet til nutidskr."}]
[null,null,"Årligt grundbeløb:",null,34409]
[]
{"$rows_left_out":9}