{"text_format":"1","workbook":"xlsx","n_sheets":10,"sheets":["gl. til nyt niveau","reguleringsprocenter","Lønark","Forside","Omregner","Omregningstabel ","Tillæg_trin","Tillæg_kr","Tid op_ned","Samlet_omk"],"not_rendered":{"charts":0,"images":9,"macros":1,"external_links":0,"defined_names":75,"comments":1,"pivot_tables":0},"unopened":[],"bounds":{"document_bytes":16777216,"sheet_cells":100000,"rows_first":2000,"rows_last":500,"rows_between":2000,"halvings":0,"cell_chars":16384,"cell_head_chars":4096},"cells_cut":0,"cells_raw":0,"read":"whole","date_system":"1900"}

{"sheet":"gl. til nyt niveau","index":0,"n_rows":395,"n_cols":6,"rows_kept":395,"cut":false,"hidden":true,"merged":[]}
[null,1.3980790000000001]
[null,null,null,"Nyt grundbeløb","Nyt grundbeløb"]
["Grundbeløb pr. 1/10-1984","I alt pr. 1. april 1999 inkl. %regulering",null,"pr. 31/3-2000","pr. 31/3-2000"]
[null,null,null,"ekskl. afrunding","inkl. afrunding"]
[null,null,null,null,null,"beløb"]
[null,"pr. gang/år","pr. måned",null,null,"+/-"]
[1.63,{"$f":"IF(A7<1000,$B$1*A7,ROUND($B$1*A7,0))","v":2.2788687699999999},null,{"$f":"B7","v":2.2788687699999999},{"$f":"IF(D7<1000,D7,ROUND(D7,-2))","v":2.2788687699999999}]
[5,6.9903950000000004,null,{"$f":"B8","v":6.9903950000000004},6.9903950000000004]
[5.8,8.1088582000000002,null,8.1088582000000002,8.1088582000000002]
[9,12.582711,null,12.582711,12.582711]
[10.5,14.6798295,null,14.6798295,14.6798295]
[12.22,17.084525380000002,null,17.084525380000002,17.084525380000002]
[12.65,17.68569935,null,17.68569935,17.68569935]
[13.39,18.720277810000002,null,18.720277810000002,18.720277810000002]
[13.75,19.22358625,null,19.22358625,19.22358625]
{"$rows_left_out":381}
{"sheet":"reguleringsprocenter","index":1,"n_rows":29,"n_cols":4,"rows_kept":29,"cut":false,"hidden":true,"merged":[]}
[]
[null,"Reguleringsprocenter",null,"pensionsudbygning"]
[null,"Valgt:",{"$f":"VLOOKUP(Forside!K11,reguleringsprocenter!B4:D15,2,TRUE)","v":1.57765}]
[null,"2020-01-01",1.4124110000000001,1]
[null,"2020-04-01",1.4177979999999999,1]
[null,"2020-10-01",1.4285110000000001,1]
[null,"2021-04-01",1.442796,1]
[null,"2021-10-01",1.456933,1]
[null,"2022-04-01",1.456933,1]
[null,"2022-10-01",1.4940180000000001,1]
[null,"2023-04-01",1.4983040000000001,1]
[null,"2023-10-01",1.5169710000000001,1]
[null,"2024-04-01",1.57765,1]
[]
[]
{"$rows_left_out":15}
{"sheet":"Lønark","index":2,"n_rows":71,"n_cols":88,"rows_kept":71,"cut":false,"hidden":true,"merged":[]}
[1,2,3,4,5,6,7,8,9,10,11,12,13,14,15,16,17,18,19,20,21,22,23,24,25,26,27,28,29,30,31,32,33,34,35,36,37,38,39,40,41,42,43,44,45,46,47,48,49,50,51,52,53,54,55,56]
["Næstved",null,null,null,null,null,null,null,null,null,null,null,null,null,null,null,null,null,null,null,null,null,null,"Løn","Årsløn",null,null,"Ureguleret ikke-pensionsgivende tillæg",null,null,null,"Årsløn ialt ",null,null,null,null,null,null,null,null,null,null,null,null,null,null,null,null,null,null,null,null,null,null,null,null,null,null,null,null,null,null,null,null,null,null,null,null,null,null,null,null,null,null,null,null,null,null,null,null,null,null,null,null,null,"Lavtlønsprojekt"]
[null,null,null,null,null,null,null,null,null,null,null,null,null,null,null,null,null,null,null,null,null,null,null,"Løn","Årsløn",null,null,"Ureguleret ikke-pensionsgivende tillæg",null,null,null,null,null,null,null,null,null,"Områdetillæg inkl. regulering",null,null,null,null,"Årsløn ialt ",null,null,null,null,null,"Pensionsgivende løn",null,null,null,null,null,null,null,null,"Pensionsgivende løn",null,null,null,null,null,"Løn","timelønninger",null,null,null,null,null,"Løn","timelønninger + 50%",null,null,null,null,null,"Løn","søndagstillæg - 50%",null,null,null,null,null,null,"2019-03-31",0,0]
[null,"Månedsløn, løngrupper",null,null,"Lønniveau:",{"$f":"VLOOKUP(beregningsdato,regpct_tabel,1,TRUE)","v":"2024-04-01"},null,"Optrapning fra:",null,null,null,null,"Pensionsgivende løn",null,null,null,null,null,"Pensionsgivende løn, optrapning fra:",null,null,null,null,"trin","Grundsats","%-reg.","Sats","Omr 1","Omr 2","Omr 3","Omr 4",null,null,null,null,null,null,1,2,3,4,null,"Omr 0","Omr 1","Omr 2","Omr 3","Omr 4",null,"Grundsats","%-reg.","Sats",null,"Pensionsudbygningspct:",null,null,{"$f":"VLOOKUP(F4,regpct_tabel,3,FALSE)","v":1},null,"Omr 0","Omr 1","Omr 2","Omr 3","Omr 4",null,"trin","Omr 0","Omr 1","Omr 2","Omr 3","Omr 4",null,"trin","Omr 0","Omr 1","Omr 2","Omr 3","Omr 4",null,"trin","Omr 0","Omr 1","Omr 2","Omr 3","Omr 4",null,null,"2019-04-01",382,0]
[null,0,1,2,3,4,null,"0->1","1->2","2->3",null,null,0,1,2,3,4,null,"0->1","1->2","2->3","3->4",null,null,{"$f":"VLOOKUP(beregningsdato,Lavtløn,2,TRUE)","v":1035},{"$f":"valgt_regulering-1","v":0.57765},"2019-04-01","2022-04-01",{"$f":"VLOOKUP(beregningsdato,Lavtløn,3,TRUE)","v":653},null,null,null,null,null,null,null,null,{"$f":"IF(beregningsdato<40087,0,regulering)","v":0.57765},{"$f":"IF(beregningsdato<40087,0,5)","v":5},null,null,null,null,null,null,null,null,null,null,null,null,null,null,null,null,null,null,null,null,null,null,null,null,null,null,null,null,null,null,null,null,null,null,null,null,null,null,null,null,null,null,null,null,null,null,"2022-04-01",{"$f":"CI4+CJ5","v":1035},653]
[1,{"$f":"AQ6/12","v":19351.75},19625.5,19814.916666666668,20088.75,20278.25,null,{"$f":"ROUND(AQ6+(AR6-AQ6)/3*faktor,0)/12","v":22401516.75},{"$f":"ROUND(AR6+(AS6-AR6)/3*faktor,0)/12","v":15506584.75},{"$f":"ROUND(AS6+(AT6-AS6)/3*faktor,0)/12","v":22408793.333333332},null,1,{"$f":"BF6/12","v":19351.75},19625.5,19814.916666666668,20088.75,20278.25,null,{"$f":"(BF6+ROUND((BG6-BF6)/3*faktor,0))/12","v":22401516.75},{"$f":"(BG6+ROUND((BH6-BG6)/3*faktor,0))/12","v":15506584.75},{"$f":"(BH6+ROUND((BI6-BH6)/3*faktor,0))/12","v":22408793.333333332},{"$f":"(BI6+ROUND((BJ6-BI6)/3*faktor,0))/12","v":15513861.416666666},null,1,147194,{"$f":"ROUND(Y6*regulering,0)","v":85027},{"$f":"Y6+Z6","v":232221},2585,4374,6959,8748,null,2082,3523,5606,7047,null,{"$f":"ROUND(VLOOKUP($X6,$X:$AJ,(4+AL$4)+$AM$5)*(1+$AL$5),0)","v":3285},5558,8844,11118,null,{"$f":"$AA6","v":232221},{"$f":"$AA6+AL6","v":235506},237779,241065,243339,null,147194,{"$f":"AW6*regulering","v":85026.614100000006},{"$f":"ROUND(SUM(AW6:AX6),0)","v":232221},null,{"$f":"ROUND(AL6*udbygningspct,0)","v":3285},{"$f":"ROUND(AM6*udbygningspct,0)","v":5558},{"$f":"ROUND(AN6*udbygningspct,0)","v":8844},{"$f":"ROUND(AO6*udbygningspct,0)","v":11118},null,{"$f":"AY6","v":232221},{"$f":"$BF6+BA6","v":235506},{"$f":"$BF6+BB6","v":237779},241065,243339,null,1,{"$f":"AQ6/1924","v":120.69698544698545},122.4043659043659,123.58575883575884,125.29365904365905,126.47557172557173,null,1,{"$f":"AQ6/1924*1.5","v":181.04547817047819},{"$f":"AR6/1924*1.5","v":183.60654885654884},{"$f":"AS6/1924*1.5","v":185.37863825363826},{"$f":"AT6/1924*1.5","v":187.94048856548858},{"$f":"AU6/1924*1.5","v":189.71335758835758},null,1,{"$f":"AQ6/1924/2","v":60.348492723492726},61.202182952182952,61.792879417879419,62.646829521829524,63.237785862785863]
[2,19649,19929.416666666668,20123.5,20403.916666666668,20597.916666666668,null,22946889.583333332,15888441.5,22947364.083333332,null,2,19649,19929.416666666668,20123.5,20403.916666666668,20597.916666666668,null,22946889.583333332,15888441.5,22947364.083333332,15882102.583333334,null,2,149455,86333,235788,2648,4481,7128,8961,null,2133,3609,5742,7218,null,3365,5694,9059,11387,null,{"$f":"$AA7","v":235788},239153,241482,244847,247175,null,149455,{"$f":"AW7*regulering","v":86332.68075},{"$f":"ROUND(SUM(AW7:AX7),0)","v":235788},null,3365,5694,9059,11387,null,{"$f":"AY7","v":235788},239153,241482,244847,247175,null,2,122.55093555093555,124.29989604989605,125.51039501039502,127.25935550935552,128.46933471933471,null,2,{"$f":"AQ7/1924*1.5","v":183.82640332640332},186.44984407484407,188.26559251559252,190.88903326403329,192.70400207900207,null,2,61.275467775467774,62.149948024948024,62.755197505197508,63.629677754677758,64.234667359667355]
[3,19954.25,20241.416666666668,20440.333333333332,20727.416666666668,20926.5,null,23499083.833333332,16283933.333333334,23492756.416666668,null,3,19954.25,20241.416666666668,20440.333333333332,20727.416666666668,20926.5,null,23499083.833333332,16283933.333333334,23492756.416666668,16298046.166666666,null,3,151777,87674,239451,2711,4590,7301,9180,null,2184,3697,5881,7395,null,3446,5833,9278,11667,null,239451,242897,245284,248729,251118,null,151777,87673.984049999999,239451,null,3446,5833,9278,11667,null,239451,242897,245284,248729,251118,null,3,124.45478170478171,126.245841995842,127.48648648648648,129.27702702702703,130.51871101871103,null,3,186.68217255717258,189.368762993763,191.22972972972974,193.91554054054055,195.77806652806655,null,3,62.227390852390855,63.122920997921,63.743243243243242,64.638513513513516,65.259355509355515]
[4,20267.916666666668,20562.25,20765.916666666668,21060.25,21263.916666666668,null,24085353.666666668,16672620.5,24085851.666666668,null,4,20267.916666666668,20562.25,20765.916666666668,21060.25,21263.916666666668,null,24085353.666666668,16672620.5,24085851.666666668,16673118.5,null,4,154163,89052,243215,2779,4703,7482,9405,null,2239,3788,6027,7576,null,3532,5976,9508,11952,null,243215,246747,249191,252723,255167,null,154163,89052.256949999995,243215,null,3532,5976,9508,11952,null,243215,246747,249191,252723,255167,null,4,126.41112266112266,128.24688149688149,129.51715176715177,131.35291060291061,132.62318087318087,null,4,189.616683991684,192.37032224532223,194.27572765072767,197.02936590436593,198.93477130977129,null,4,63.205561330561331,64.123440748440743,64.758575883575887,65.676455301455306,66.311590436590436]
[5,20590.166666666668,20891.666666666668,21100.5,21402,21610.666666666668,null,24671632.166666668,17095383.416666668,24672142.5,null,5,20590.166666666668,20891.666666666668,21100.5,21402,21610.666666666668,null,24671632.166666668,17095383.416666668,24672142.5,17082266.916666668,null,5,156614,90468,247082,2847,4819,7666,9636,null,2293,3882,6175,7762,null,3618,6124,9742,12246,null,247082,250700,253206,256824,259328,null,156614,90468.077099999995,247082,null,3618,6124,9742,12246,null,247082,250700,253206,256824,259328,null,5,128.42099792099793,130.30145530145529,131.6039501039501,133.48440748440748,134.78586278586278,null,5,192.6314968814969,195.45218295218294,197.40592515592516,200.22661122661123,202.17879417879416,null,5,64.210498960498967,65.150727650727646,65.801975051975049,66.742203742203742,67.392931392931388]
[6,20921.583333333332,21230.5,21444.416666666668,21753.25,21967.166666666668,null,25278360.166666668,17511342.416666668,25272069.5,null,6,20921.583333333332,21230.5,21444.416666666668,21753.25,21967.166666666668,null,25278360.166666668,17511342.416666668,25272069.5,17511865.166666668,null,6,159135,91924,251059,2917,4937,7854,9873,null,2350,3977,6326,7953,null,3707,6274,9980,12547,null,251059,254766,257333,261039,263606,null,159135,91924.332750000001,251059,null,3707,6274,9980,12547,null,251059,254766,257333,261039,263606,null,6,130.48804573804574,132.4147609147609,133.74896049896049,135.67515592515593,137.00935550935552,null,6,195.73206860706861,198.62214137214136,200.62344074844071,203.5127338877339,205.51403326403329,null,6,65.244022869022871,66.207380457380452,66.874480249480243,67.837577962577967,68.504677754677758]
[7,21261.583333333332,21578.166666666668,21797.5,22114,22333.083333333332,null,25905537,17954563.916666668,25899259.5,null,7,21261.583333333332,21578.166666666668,21797.5,22114,22333.083333333332,null,25905537,17954563.916666668,25899259.5,17934659.416666668,null,7,161721,93418,255139,2989,5060,8049,10118,null,2408,4076,6484,8150,null,3799,6431,10229,12858,null,255139,258938,261570,265368,267997,null,161721,93418.135649999997,255139,null,3799,6431,10229,12858,null,255139,258938,261570,265368,267997,null,7,132.60862785862787,134.5831600831601,135.95114345114345,137.92515592515593,139.29158004158003,null,7,198.9129417879418,201.87474012474013,203.92671517671516,206.8877338877339,208.93737006237006,null,7,66.304313929313935,67.291580041580048,67.975571725571726,68.962577962577967,69.645790020790017]
[8,21623.916666666668,21948.666666666668,22173.583333333332,22498.166666666668,22723,null,26573616.916666668,18411435.25,26560539.666666668,null,8,21623.916666666668,21948.666666666668,22173.583333333332,22498.166666666668,22723,null,26573616.916666668,18411435.25,26560539.666666668,18405171.25,null,8,164477,95010,259487,3067,5190,8256,10379,null,2470,4181,6650,8360,null,3897,6596,10491,13189,null,259487,263384,266083,269978,272676,null,164477,95010.139049999998,259487,null,3897,6596,10491,13189,null,259487,263384,266083,269978,272676,null,8,134.86850311850313,136.8939708939709,138.29677754677755,140.32120582120581,141.72349272349271,null,8,202.30275467775471,205.34095634095635,207.44516632016632,210.48180873180871,212.58523908523907,null,8,67.434251559251564,68.446985446985451,69.148388773388774,70.160602910602904,70.861746361746356]
[9,22304.166666666668,22637.083333333332,22867.416666666668,23200.166666666668,23430.583333333332,null,{"$f":"ROUND(AQ14+(AR14-AQ14)/3*faktor,0)/12","v":27242014.75},{"$f":"ROUND(AR14+(AS14-AR14)/3*faktor,0)/12","v":18854997.5},{"$f":"ROUND(AS14+(AT14-AS14)/3*faktor,0)/12","v":27228951.083333332},null,9,22304.166666666668,22637.083333333332,22867.416666666668,23200.166666666668,23430.583333333332,null,{"$f":"(BF14+ROUND((BG14-BF14)/3*faktor,0))/12","v":27242014.75},{"$f":"(BG14+ROUND((BH14-BG14)/3*faktor,0))/12","v":18854997.5},{"$f":"(BH14+ROUND((BI14-BH14)/3*faktor,0))/12","v":27228951.083333332},{"$f":"(BI14+ROUND((BJ14-BI14)/3*faktor,0))/12","v":18862374.083333332},null,9,169651,97999,267650,3143,5319,8461,10637,null,2532,4284,6815,8568,null,3995,6759,10752,13517,{"$f":"AR14/12","v":22637.083333333332},267650,{"$f":"ROUND($AA14+AL14,0)","v":271645},{"$f":"$AA14+AM14","v":274409},{"$f":"$AA14+AN14","v":278402},{"$f":"$AA14+AO14","v":281167},null,169651,97998.900150000001,267650,null,3995,6759,10752,13517,null,267650,271645,274409,278402,281167,null,9,139.11122661122661,141.18762993762994,142.62422037422039,144.69958419958419,146.13669438669439,null,9,208.66683991683993,211.7814449064449,213.93633056133058,217.04937629937629,219.20504158004158,null,9,69.555613305613306,70.593814968814968,71.312110187110193,72.349792099792097,73.068347193347194]
[10,22461.666666666668,22802.833333333332,23038.916666666668,23380,23616.25,null,27916703.25,19325290.916666668,27910467,null,10,22461.666666666668,22802.833333333332,23038.916666666668,23380,23616.25,null,27916703.25,19325290.916666668,27910467,19339495,null,10,170849,98691,269540,3221,5451,8672,10903,null,2595,4391,6985,8782,null,4094,6927,11020,13855,null,269540,{"$f":"$AA15+AL15","v":273634},276467,280560,283395,null,170849,98690.924849999996,269540,null,4094,6927,11020,13855,null,269540,273634,276467,280560,283395,null,10,140.0935550935551,142.22141372141371,143.69386694386694,145.82120582120581,147.29469854469855,null,10,210.14033264033264,213.33212058212058,215.54080041580039,218.73180873180871,220.94204781704781,null,10,70.046777546777548,71.110706860706856,71.846933471933468,72.910602910602904,73.647349272349274]
{"$rows_left_out":57}
{"sheet":"Forside","index":3,"n_rows":15,"n_cols":11,"rows_kept":15,"cut":false,"hidden":false,"merged":[[14,3,14,7]]}
[]
[]
[]
[]
[]
[]
[]
[]
[]
[]
[null,null,null,null,null,null,null,null,null,"Lønniveau:","2024-04-01"]
[]
[]
[]
[null,null,null,"Hvad betyder det for lønnen, hvis man ændrer på lønsammensætning eller timetal ?"]
{"$rows_left_out":1}
{"sheet":"Omregner","index":4,"n_rows":24,"n_cols":9,"rows_kept":24,"cut":false,"hidden":false,"merged":[]}
[]
[]
[]
[]
[]
[]
[]
[]
[]
[]
[null,null,null,"Valgt lønniveau:",null,{"$f":"Forside!K11","v":"2024-04-01"},null,"Timetal:",37]
[]
[null,"1) Grundbeløb pr. 31-3-2000 omregnet til nutidskr. "]
[null,null,"Årligt grundbeløb:",null,11300]
[]
{"$rows_left_out":10}
{"sheet":"Omregningstabel ","index":5,"n_rows":25,"n_cols":16,"rows_kept":25,"cut":false,"hidden":true,"merged":[]}
[null,null,null,1.362716,1.3824959999999999,1.3980790000000001,1.018559,1.040662,1.0511569999999999,1.061566,1.0834220000000001,1.0886800000000001,1.0926750000000001,1.109523,1.1200380000000001,1.1244540000000001]
[]
[]
[]
[]
[]
[null,"Indtast beløb:",1000]
[]
[]
[null,null,"1/10 '84"]
[null,null,{"$f":"Beløb","v":1000},"1/4 '98"]
[null,"1/4-98",{"$f":"Beløb*_1_4_1998","v":1362.7160000000001},{"$f":"Beløb","v":1000},"1/10 '98"]
[null,"1/10-98",{"$f":"Beløb*_1_10_1998","v":1382.4959999999999},{"$f":"Beløb/_1_4_1998*_1_10_1998","v":1014.515130078461},{"$f":"Beløb","v":1000},"1/4 '99"]
[null,"1/4-99",{"$f":"Beløb*_1_4_1999","v":1398.0790000000002},{"$f":"Beløb/_1_4_1998*_1_4_1999","v":1025.9503814441161},{"$f":"Beløb/_1_10_1998*_1_4_1999","v":1011.2716420156008},{"$f":"Beløb","v":1000}]
[null,"Grundbeløb pr. 31/3-00",{"$f":"ROUND(C14,-2)","v":1400},{"$f":"ROUND(D14,-2)","v":1000},{"$f":"ROUND(E14,-2)","v":1000},{"$f":"ROUND(F14,-2)","v":1000},"1/4 '00"]
{"$rows_left_out":11}
{"sheet":"Tillæg_trin","index":6,"n_rows":16,"n_cols":4,"rows_kept":16,"cut":false,"hidden":true,"merged":[[1,1,1,7]]}
[3]
[]
[null,"Valgt lønniveau: ",{"$f":"Forside!K11","v":"2024-04-01"}]
[]
[null,"Løngruppe",null,3]
[null,"Timer/uge",null,37]
[null,"Pensions-% inkl. evt. fritvalgs-%",null,13.89]
[null,"Særlig feriegodtgørelse, aktuel pct.",null,1.95]
[]
[null,"Stigning:","Fra","Til"]
[null,"Løntrin ",18,19]
[]
[null,"Løn",{"$f":"(VLOOKUP(til_trin,Lønark!A5:F61,løngruppe+2,FALSE)-VLOOKUP(fra_trin,Lønark!A5:F61,løngruppe+2,FALSE))/37*timetal*12","v":4488}]
[null,"Pension inkl. evt. fritvalgstillæg",{"$f":"(VLOOKUP(til_trin,Lønark!L5:Q61,løngruppe+2,FALSE)-VLOOKUP(fra_trin,Lønark!L5:Q61,løngruppe+2,FALSE))/37*timetal*pensionsstatus%*12","v":623.38319999999999}]
[null,"Ferietillæg",{"$f":"ferie_pct%*C13","v":87.516000000000005}]
{"$rows_left_out":2}
{"sheet":"Tillæg_kr","index":7,"n_rows":15,"n_cols":4,"rows_kept":15,"cut":false,"hidden":true,"merged":[[9,1,9,2]]}
[2]
[]
[null,null,"Valgt lønniveau:",{"$f":"Forside!K11","v":"2024-04-01"}]
[]
[{"$f":"VLOOKUP(dummy,reg_procenter,2,FALSE)","v":{"$error":"#NAME?"}},null,"Årligt beløb, 31.3.2000 niveau ",12900]
[null,null,"Timer/uge",30]
[null,null,"Pension-% inkl. evt. fritvalgs-%",13.89]
[null,null,"Særlig feriegodtg., aktuel pct.",1.95]
[]
[]
[null,null,"bruttoudgift / år","bruttoudgift / md"]
[null,"Løn",{"$f":"kr*valgt_regulering/37*timetal","v":16501.366216216218},{"$f":"beløb/12","v":1375.1138513513515}]
[null,"Pension inkl. evt. fritvalgstillæg",{"$f":"beløb*pensionsstatus%","v":2292.0397674324327},{"$f":"C13/12","v":191.00331395270271}]
[null,"Ferietillæg",{"$f":"D8%*(C12)","v":321.77664121621626},{"$f":"C14/12","v":26.814720101351355}]
[null,"Bruttoudgift i alt",{"$f":"ROUND(SUM(C12:C14),0)","v":19115},{"$f":"ROUND(SUM(D12:D14),0)","v":1593}]
{"$rows_left_out":1}
{"sheet":"Tid op_ned","index":8,"n_rows":31,"n_cols":8,"rows_kept":31,"cut":false,"hidden":false,"merged":[]}
[2,"Valgt lønniveau: ",{"$f":"Forside!K11","v":"2024-04-01"}]
[]
[null,"Grundoplysninger:"]
[null,"Løngruppe",4]
[null,"Pensions-% inkl. evt. fritvalgs-%",14.29]
[null,"Særlig feriegodtgørelse, aktuel procent",1.95]
[]
[]
[null,"Lønsammensætning (trin i alt og grundbeløb i alt)","Før ændring",null,"Efter ændring"]
[]
[null,"Løndele:","I alt"]
[]
[null,"Løntrin - centralt og lokalt aftalte",19,null,19]
[]
[null,"Tillæg (grundbeløb 31.3.2000) kr./år centralt og lokalt aftalte"]
{"$rows_left_out":17}
{"sheet":"Samlet_omk","index":9,"n_rows":26,"n_cols":3,"rows_kept":26,"cut":false,"hidden":false,"merged":[]}
[2,"Valgt lønniveau: ",{"$f":"Forside!K11","v":"2024-04-01"}]
[]
[null,"Løngruppe",0]
[null,"Timer/uge",37]
[null,"Pensions-% inkl. evt. fritvalgs-%",14.29]
[null,"Særlig feriegodtgørelse, aktuel pct.",1.95]
[]
[null,"Løntrin ",21]
[]
[null,"Reguleret tillæg (31.3.2000) kr./år",20800]
[]
[]
[null,"Løn/time",{"$f":"IFERROR(ROUND(VLOOKUP(fra_trin,Lønark!A5:AU61,løngruppe+43,FALSE)/1924,2)+ROUND(C10*valgt_regulering/1924,2),ROUND(C10*valgt_regulering/1924,2))","v":184.29}]
[null,"Pension inkl. evt. fritvalgstillæg",{"$f":"C13*pensionsstatus%","v":26.335041}]
[null,"Ferietillæg",{"$f":"C6%*C13","v":3.593655}]
{"$rows_left_out":11}